Official Murl Engine Forum
fatal error LNK1123 - Printable Version

+- Official Murl Engine Forum (http://murlengine.com/forum)
+-- Forum: Murl Engine (http://murlengine.com/forum/forumdisplay.php?fid=5)
+--- Forum: Tutorials (http://murlengine.com/forum/forumdisplay.php?fid=6)
+--- Thread: fatal error LNK1123 (/showthread.php?tid=176)



fatal error LNK1123 - erlimoen - 18 May 2014

Hello. I am trying to build tutorials and getting same error. Here is a log:
1>------ Build started: Project: cube_v1, Configuration: Debug Win32 ------
1>cube.obj : warning LNK4075: ignoring '/EDITANDCONTINUE' due to '/INCREMENTAL:NO' specification
1>     Creating library ..\..\..\binaries\win32\vs2010\Debug\cube_v1.lib and object ..\..\..\binaries\win32\vs2010\Debug\cube_v1.exp
1>LINK : fatal error LNK1123: failure during conversion to COFF: file invalid or corrupt
========== Build: 0 succeeded, 1 failed, 0 up-to-date, 0 skipped ==========


I've tried to set 'INCREMENTAL:NO' as you can see. But it doesn't effect.


RE: fatal error LNK1123 - Ketschak - 18 May 2014

Which version of Visual Studio are you using? You need to use VS2010 or VS2008.

If you are already using VS2010, try to install Visual Studio 2010 with SP1. Visual Studio seems to have a problem if VS2012 and VS2010 w/o SP is installed. See also http://stackoverflow.com/questions/10888391/error-link-fatal-error-lnk1123-failure-during-conversion-to-coff-file-inval

Hope this helps.


RE: fatal error LNK1123 - erlimoen - 18 May 2014

I have both Visual Studio 2013 and Visual Studio 2010 Express installed.
Trying to remove them and install VS2010 only... Will write out if get some results.


RE: fatal error LNK1123 - erlimoen - 18 May 2014

Fixed by installing SP1 for Visual Studio 2010


RE: fatal error LNK1123 - Ketschak - 19 May 2014

(18 May 2014, 11:10)erlimoen Wrote: Fixed by installing SP1 for Visual Studio 2010

Cool.

The thread would be better placed in the Tutorials forum. I will move it there.